chloritisation
type: Concept
definition: Néoformation de chlorites dans des altérites ou des horizons de sols à drainage interne lent, à partir d'éléments libérés par l'hydrolyse de minéraux ferromagnésiens. (Source : INRA)
in scheme: PLP
preferred label: chloritization @en
related: http://opendata.inrae.fr/PLP/180
top concept of: PLP

RDF description of
primary topic: chloritisation