chlorose ferrique
type: Concept
subject: Pedology @en
subject: Agronomie
subject: Pédologie
subject: Agronomy @en
definition: Maladie qui, dans le cas de sols à teneur élevée en calcaire actif, frappe certaines plantes (vigne, cerisiers, pins sylvestres, mélèzes du Japon, lupin blanc, etc.). (Source : INRA)
in scheme: PLP
note: La chlorose ferrique résulte d'un défaut d'absorption ou d'utilisation du fer par la plante. D'autres facteurs de constitution ou d'état instantané jouent aussi un rôle dans le déclenchement de cette maladie comme par exemple un excès d'eau dans le sol au printemps. (Source : INRA)
preferred label: iron chlorosis @en
related: http://opendata.inrae.fr/PLP/366
top concept of: PLP

RDF description of
primary topic: chlorose ferrique