RDF description of
primary topic: chronoséquence de sols

chronoséquence de sols
type: Concept
subject: Pedology @en
subject: Pédologie
definition: Succession théorique dans le temps de sols issus de matériaux parentaux identiques, dont les différences sont dues uniquement à la durée de la pédogenèse. (Source : INRA)
in scheme: PLP
note: Un bon exemple est donné par les sols développés dans des alluvions anciennes d'âge croissant d'une même rivière , qui ont le même bassin d'alimentation amont. (Source : INRA)
preferred label: soil chronosequence @en
top concept of: PLP