clarté
type: Concept
subject: Pedology @en
subject: Pédologie
definition: Axe de l'espace des couleurs à trois dimensions et coordonnées cylindriques qui correspond à l'addition de blanc ou de noir à la teinte de base. (Source : INRA)
in scheme: PLP
preferred label: value @en
related: http://opendata.inrae.fr/PLP/225
related: http://opendata.inrae.fr/PLP/635
top concept of: PLP

RDF description of
primary topic: clarté