adsorption
type: Concept
subject: Pedology
subject: Pédologie @fr
definition: Fixation réversible de particules, molécules ou ions sur les surfaces des constituants du complexe d'échange. (Source : INRA) @fr
in scheme: PLP
related: http://opendata.inrae.fr/PLP/509
related: http://opendata.inrae.fr/PLP/204
top concept of: PLP

RDF description of
primary topic: adsorption