clinohumique
type: Concept
subject: Pedology @en
subject: Pédologie
modified: 2020-08-27T15:18:49.316+02:00
alternative label: isohumique
definition: Qualifie un solum présentant dans sa partie supérieure une forte accumulation de matières organiques fortement colorées et très liées à la matière minérale qui décroît progressivement avec la profondeur (Référentiel Pédologique). (Source : INRA)
in scheme: PLP
note: Il y a encore au moins 0,6 % de carbone organique à plus de 40 cm de profondeur. Le Référentiel Pédologique a proposé de remplacer l'ancien terme " isohumique " par " clinohumique ", le préfixe " iso " n'étant pas adéquat, car les teneurs en matières organiques de ces sols décroissent nettement avec la profondeur. (Source : INRA)
related: http://opendata.inrae.fr/PLP/533
top concept of: PLP

RDF description of
primary topic: clinohumique