RDF description of
primary topic: cobalt

cobalt
type: Concept
subject: Pedology @en
subject: Pédologie
definition: Métal naturellement présent dans les sols en très faibles quantités (le plus souvent 2 à 20 mg/kg). (Source : INRA)
in scheme: PLP
note: Cet élément, peu toxique, est de ce fait peu redouté et rarement analysé. Il serait assez mobile en milieu acide et hydromorphe. (Source : INRA)
related: http://opendata.inrae.fr/PLP/318
top concept of: PLP