RDF description of
primary topic: collemboles

collemboles
type: Concept
subject: Pedology @en
subject: Pédologie
definition: Insectes sans ailes, détriticoles ou humivores, se nourrissant de débris végétaux et de champignons et jouant ainsi un rôle important dans la formation de certaines formes d'humus. (Source : INRA)
in scheme: PLP
preferred label: collembola @en
top concept of: PLP