RDF description of
primary topic: colloïdes

colloïdes
type: Concept
subject: Pedology @en
subject: Agronomie
subject: Pédologie
subject: Agronomy @en
definition: Substances constituées de particules extrêmement fines (moins de 0,5 µm) ayant de ce fait des propriétés particulières dites colloïdales. (Source : INRA)
in scheme: PLP
note: Les propriétés colloïdales sont une charge électrique, une grande surface spécifique et la capacité de rester en suspension dans l'eau ou de floculer selon les conditions physico-chimiques du milieu. Dans les sols, les colloïdes sont : les argiles les plus fines, certaines matières organiques, la silice et les oxydes de fer et d'aluminium. Ils assurent en grande partie la cohésion des agrégats. Lorsqu'ils sont à l'état dispersé, ils sont susceptibles de migrer. (Source : INRA)
preferred label: colloids @en
related: http://opendata.inrae.fr/PLP/548
top concept of: PLP