RDF description of
primary topic: aérobiose

aérobiose
type: Concept
subject: Pedology @en
subject: Agronomie
subject: Pédologie
subject: Agronomy @en
definition: Vie nécessitant la présence de l'oxygène de l'air. (Source : INRA)
in scheme: PLP
note: Sont dits aérobies les organismes qui ont besoin d'oxygène de façon facultative ou obligatoire pour leur croissance. (Source : INRA)
preferred label: aerobiosis @en
related: http://opendata.inrae.fr/PLP/342
related: http://opendata.inrae.fr/PLP/52
related: http://opendata.inrae.fr/PLP/58
top concept of: PLP