Colluviosols
type: Concept
subject: Pedology @en
subject: Pédologie
definition: Catégorie de solums développés entièrement dans des colluvions dont l'épaisseur excède 50 cm à partir de la surface (Référentiel Pédologique). (Source : INRA)
in scheme: PLP
top concept of: PLP

RDF description of
primary topic: Colluviosols