compactage
type: Concept
subject: Pedology @en
subject: Pédologie
modified: 2020-08-27T15:27:31.367+02:00
alternative label: tassement
definition: Diminution de la porosité d'un horizon sous l'action de la pression exercée par des engins agricoles ou par le piétinement des animaux. (Source : INRA)
in scheme: PLP
note: Lorsque la microporosité est affectée, le compactage est difficilement réversible. (Source : INRA)
preferred label: compaction @en
top concept of: PLP

RDF description of
primary topic: compactage