RDF description of
primary topic: complexe adsorbant

complexe adsorbant
type: Concept
subject: Pedology @en
subject: Agronomie
subject: Pédologie
subject: Agronomy @en
alternative label: complexe d'échange
definition: Ensemble des constituants des sols susceptibles de retenir des cations provenant de la solution du sol, mais qui ne sont que momentanément fixés et demeurent échangeables. (Source : INRA)
in scheme: PLP
note: Il s'agit d'une adsorption, phénomène de surface, sans réaction chimique. Ces constituants sont surtout les minéraux argileux phylliteux et les matières organiques humifiées. (Source : INRA)
preferred label: adsorbing complex @en
related: http://opendata.inrae.fr/PLP/150
related: http://opendata.inrae.fr/PLP/19
top concept of: PLP