complexe argilo-humique
type: Concept
subject: Pedology @en
subject: Agronomie
subject: Pédologie
subject: Agronomy @en
definition: Résultat de l'association étroite entre les minéraux argileux et des constituants organiques humifiés, par l'intermédiaire de cations métalliques comme le calcium, le fer ou l'aluminium. (Source : INRA)
in scheme: PLP
note: Ce complexe forme les agrégats stables des structures construites grumeleuses et grenues. Ce terme est désuet. (Source : INRA)
preferred label: clay-humus complex @en
related: http://opendata.inrae.fr/PLP/207
top concept of: PLP

RDF description of
primary topic: complexe argilo-humique