complexes organo-minéraux
type: Concept
subject: Pedology @en
subject: Pédologie
definition: Associations étroites entre les minéraux argileux et des constituants organiques. (Source : INRA)
in scheme: PLP
note: Ils exercent sur la pédogenèse une influence très différente, voire opposée, selon la nature des constituants organiques en cause. Les composés solubles ou à petites molécules favorisent les processus d'entraînement soit par la formation de complexes organo-métalliques mobiles (chéluviation), soit par dépôt d'une pellicule hydrophile autour des particules d'argiles (illuviation). Les composés insolubles à grosses molécules exercent une action inverse : ils jouent un rôle de ciment entre les particules minérales et favorisent la formation d'agrégats stables en présence d'une quantité suffisante de cations floculants (Ca2+, Al3+, Fe(OH)n . (Source : INRA)
preferred label: organo-mineral complexes @en
related: http://opendata.inrae.fr/PLP/507
related: http://opendata.inrae.fr/PLP/176
related: http://opendata.inrae.fr/PLP/205
top concept of: PLP

RDF description of
primary topic: complexes organo-minéraux