RDF description of
primary topic: affleurement rocheux

affleurement rocheux
type: Concept
subject: Geology @en
subject: Pedology @en
subject: Géologie
subject: Pédologie
alternative label: rock outcrop @en
definition: Emplacement où il n'y a pas de couverture pédologique et où une roche dure affleure. (Source : INRA)
in scheme: PLP
note: Ne pas confondre avec un bloc détaché du substrat rocheux. (Source : INRA)
preferred label: bedrock outcrop @en
top concept of: PLP