conditions pédoclimatiques
type: Concept
subject: Pedology @en
subject: Agronomie
subject: Pédologie
subject: Agronomy @en
definition: Ensemble des caractères du climat local et des caractères des sols d'une exploitation ou d'une parcelle, servant de cadre à la production agricole. (Source : INRA)
in scheme: PLP
preferred label: pedoclimatic conditions @en
related: http://opendata.inrae.fr/PLP/660
top concept of: PLP

RDF description of
primary topic: conditions pédoclimatiques