RDF description of
primary topic: conductivité électrique

conductivité électrique
type: Concept
subject: Pedology @en
subject: Pédologie
definition: Propriété qu'a un milieu de transmettre un courant électrique. (Source : INRA)
in scheme: PLP
note: En ce qui concerne les sols, la conductivité électrique est proportionnelle à la salinité. Sa mesure s'effectue sur un " extrait de pâte saturée ". La conductivité de cet extrait est la conductance de cette solution mesurée entre des électrodes de 1 cm2 de surface, distantes de 1 cm. La conductivité est désormais exprimée en milliSiemens/cm (mS/cm) (autrefois en millimhos/cm = mmhos/cm). (Source : INRA)
preferred label: electric conductivity @en
related: http://opendata.inrae.fr/PLP/357
related: http://opendata.inrae.fr/PLP/830
top concept of: PLP