RDF description of
primary topic: consistance

consistance
type: Concept
subject: Pedology @en
subject: Pédologie
definition: Ensemble de diverses propriétés pouvant être testées sur le terrain sur chaque horizon, à différents états d'humidité : adhésivité, compacité, plasticité, friabilité, fragilité ou dureté. (Source : INRA)
in scheme: PLP
preferred label: consistence @en
top concept of: PLP