RDF description of
primary topic: contamination

contamination
type: Concept
subject: Pedology @en
subject: Pédologie
subject: Environment @en
subject: Environnement
definition: Forte augmentation dans un sol de la teneur en une (ou plusieurs) substance(s) potentiellement toxique(s) minérale(s) (métaux traces) ou organique(s) (pesticides, PCB, dioxines, hydrocarbures, etc.), directement ou indirectement liée à une activité humaine, mais sans qu'il apparaisse de dommages aux écosystèmes ou agrosystèmes. (Source : INRA)
in scheme: PLP
note: Souvent, la substance introduite n'existe pas dans la nature (elle est dite xénobiotique). (Source : INRA)
related: http://opendata.inrae.fr/PLP/216
related: http://opendata.inrae.fr/PLP/734
top concept of: PLP