RDF description of
primary topic: contrainte (propriété)

contrainte (propriété)
type: Concept
subject: Pedology @en
subject: Agronomie
subject: Pédologie
subject: Agronomy @en
definition: Propriété d'un sol ou d'un terrain pouvant constituer une limitation à telle ou telle production agricole, dans un certain contexte technique et climatique. (Source : INRA)
in scheme: PLP
note: Ainsi une texture argileuse lourde ou une pente très forte constituent des contraintes majeures à la plupart des productions agricoles. (Source : INRA)
preferred label: soil constraint @en
top concept of: PLP