RDF description of
primary topic: contrainte (force)

contrainte (force)
type: Concept
subject: Pedology @en
subject: Pédologie
definition: Force appliquée à un échantillon de sol de différentes manières (pressions, succions, dessiccations) et pouvant de ce fait modifier son état d'humidité, voire l'organisation de sa phase solide. (Source : INRA)
in scheme: PLP
note: Dans ce sens, le terme contrainte s'applique aussi aux solums et aux horizons in situ. (Source : INRA)
preferred label: constraint @en
related: http://opendata.inrae.fr/PLP/360
related: http://opendata.inrae.fr/PLP/219
top concept of: PLP