RDF description of
primary topic: âge d'un sol

âge d'un sol
type: Concept
definition: Durée d'évolution pédogénétique. (Source : INRA)
in scheme: PLP
note: En cas de très faible vitesse d'évolution, un sol peut être âgé sans être fortement différencié. Inversement, un sol peut être fortement différencié et relativement jeune. (Source : INRA)
preferred label: soil age @en
related: http://opendata.inrae.fr/PLP/275
related: http://opendata.inrae.fr/PLP/672
related: http://opendata.inrae.fr/PLP/349
related: http://opendata.inrae.fr/PLP/735
top concept of: PLP