RDF description of
primary topic: couches D

couches D
type: Concept
subject: Pedology @en
subject: Pédologie
definition: Roches non altérées, qui constituent une discontinuité physique ou mécanique à la base de certains sols, composées de matériaux durs fragmentés, puis déplacés ou transportés, non consolidés, formant un ensemble pseudomeuble où les éléments grossiers dominent (cailloutis, grèves alluviales, éboulis cryoclastiques, blocailles, éboulis, moraines, etc.) (Référentiel Pédologique). (Source : INRA)
in scheme: PLP
note: Ces couches peu cohérentes sont souvent faciles à travailler avec les outils agricoles habituels. (Source : INRA)
preferred label: D layers @en
related: http://opendata.inrae.fr/PLP/426
top concept of: PLP