RDF description of
primary topic: couches R

couches R
type: Concept
subject: Pedology @en
subject: Pédologie
definition: Roches dures, massives ou peu fragmentées, non altérées, qui constituent une discontinuité physique ou mécanique à la base de certains sols (Référentiel Pédologique). (Source : INRA)
in scheme: PLP
note: Ces couches, qui présentent souvent des diaclases et/ou des fissures, sont très difficilement dislocables par les outils agricoles habituels et le sol ne peut être approfondi. (Source : INRA)
preferred label: R layers @en
top concept of: PLP