couleurs des sols
type: Concept
subject: Pedology @en
subject: Pédologie
definition: Teintes d'un horizon, d'un sol ou d'un trait pédologique, désignées soit en utilisant le vocabulaire courant, soit en référence à des chartes de couleurs. (Source : INRA)
in scheme: PLP
preferred label: soil colours @en
related: http://opendata.inrae.fr/PLP/945
related: http://opendata.inrae.fr/PLP/187
related: http://opendata.inrae.fr/PLP/764
related: http://opendata.inrae.fr/PLP/635
top concept of: PLP

RDF description of
primary topic: couleurs des sols