craies
type: Concept
subject: Geology @en
subject: Pedology @en
subject: Géologie
subject: Pédologie
definition: Roches sédimentaires marines, contenant plus de 90 % de CaCO3, à grain fin, blanches, poreuses, tendres et friables, qui sont formées pour la plus grande part par une accumulation de tests calcaires d'algues unicellulaires. (Source : INRA)
in scheme: PLP
note: Roches très spéciales par leurs propriétés chimiques et hydriques, fréquentes dans les formations du Crétacé supérieur du Bassin parisien et dans le sud-est de l'Angleterre. Les divers types de craie sont dénommés selon la présence d'organismes ou de minéraux accessoires particuliers : craie à oursins, craie dolomitisée, argileuse, phosphatée, glauconieuse, etc. Les cristaux de calcite, soudés à leurs points de contact, donc sans ciment, laissent entre eux 40 % de porosité. L'assemblage des particules élémentaires détermine des cavités dont le diamètre varie de 0,2 à 3 µm formant un réseau ouvert et continu, accessible en totalité à l'air et à l'eau. Il en résulte la possibilité de transferts d'eau capillaire depuis les craies en place vers les horizons supérieurs et un caractère extrêmement gélif. La gélifraction des craies a été intense durant toutes les périodes glaciaires du Quaternaire (voir : graveluche). Les sols crayeux présentent des propriétés extraordinaires : souvent plus de 70 % de CaCO3 ; pH compris entre 7,9 et 8,5 ; surabondance du calcaire " actif " ; risque de rétrogradation du phosphore. (Source : INRA)
preferred label: chalks @en
top concept of: PLP

RDF description of
primary topic: craies