crotovina
type: Concept
subject: Pedology @en
subject: Pédologie
definition: Galerie d'animaux fouisseurs ou de gros lombriciens comblée par des matériaux en provenance d'autres horizons ou par des accumulations de substances. (Source : INRA)
in scheme: PLP
note: En général, il y a mouvement du haut vers le bas mais l'inverse peut être observé. Il y a contraste de couleur, de texture et souvent de compacité entre le matériau de comblement et l'horizon environnant. (Source : INRA)
top concept of: PLP

RDF description of
primary topic: crotovina