RDF description of
primary topic: croûte de battance

croûte de battance
type: Concept
subject: Pedology @en
subject: Agronomie
subject: Pédologie
subject: Agronomy @en
alternative label: sealing crust @en
definition: Croûte très mince (0,5 à 10 mm) se formant à la surface d'un sol nu sous l'action des gouttes de pluie, suite à la destruction des agrégats et l'individualisation des particules de limons. (Source : INRA)
in scheme: PLP
note: Cette croûte fait obstacle à l'infiltration normale des eaux de pluie et génère le flacage, puis le ruissellement. (Source : INRA)
preferred label: slaking crust @en
related: http://opendata.inrae.fr/PLP/377
related: http://opendata.inrae.fr/PLP/822
related: http://opendata.inrae.fr/PLP/524
top concept of: PLP