RDF description of
primary topic: croûte calcaire

croûte calcaire
type: Concept
subject: Pedology @en
subject: Pédologie
definition: Horizon continu d'accumulation généralisée de calcaire secondaire, plus ou moins induré, présentant souvent une structure interne lamellaire ou rubanée. (Source : INRA)
in scheme: PLP
note: Les croûtes calcaires se présentent comme une superposition de feuillets durcis mais non pétrifiés, de quelques millimètres à quelques centimètres d'épaisseur. Ces feuillets ne sont pas continus mais séparés par des fentes et anastomosés. La structure interne de chaque feuillet peut être massive, nodulaire ou finement feuilletée. (Source : INRA)
preferred label: calcareous crust @en
related: http://opendata.inrae.fr/PLP/462
related: http://opendata.inrae.fr/PLP/324
related: http://opendata.inrae.fr/PLP/147
related: http://opendata.inrae.fr/PLP/146
top concept of: PLP