RDF description of
primary topic: cryosols

cryosols
type: Concept
subject: Pedology @en
subject: Pédologie
definition: Catégorie de sols caractérisés par l'action intense du gel et du dégel presque en permanence sous climats glaciaires ou en haute montagne et une faible différenciation (Référentiel Pédologique). (Source : INRA)
in scheme: PLP
note: Dans la Base de référence mondiale pour les ressources en sol (WRB), les cryosols sont des groupes de sols de référence caractérisés par l'existence d'un permafrost et dont la pédogenèse et les propriétés sont le résultat de processus liés au gel tels que cycles gel/dégel, cryoturbations, soulèvement par le gel, tri cryogène, développement de fentes en coin et ségrégation de glace. (Source : INRA)
related: http://opendata.inrae.fr/PLP/890
related: http://opendata.inrae.fr/PLP/880
related: http://opendata.inrae.fr/PLP/274
related: http://opendata.inrae.fr/PLP/234
related: http://opendata.inrae.fr/PLP/244
related: http://opendata.inrae.fr/PLP/985
related: http://opendata.inrae.fr/PLP/843
top concept of: PLP