RDF description of
primary topic: cryoturbé

cryoturbé
type: Concept
subject: Geology @en
subject: Pedology @en
subject: Géologie
subject: Pédologie
definition: Qualifie un horizon, un sol ou un matériau fortement remanié par la cryoturbation. (Source : INRA)
in scheme: PLP
preferred label: cryoturbated @en
top concept of: PLP