cutanes de tension
type: Concept
subject: Pedology @en
subject: Pédologie
definition: Revêtements dus à une modification in situ des particules argileuses sous l'effet de forces mécaniques différentielles comme le cisaillement. (Source : INRA)
in scheme: PLP
note: Ce ne sont pas des revêtements par dépôt. (Source : INRA)
preferred label: stress cutans @en
related: http://opendata.inrae.fr/PLP/239
top concept of: PLP

RDF description of
primary topic: cutanes de tension