cutanes d'illuviation
type: Concept
subject: Pedology @en
subject: Pédologie
definition: Revêtements formés suite à un déplacement de matières (en solution ou sous forme de suspension) suivi d'un re-dépôt. (Source : INRA)
in scheme: PLP
note: Les argilanes d'illuviation sont faciles à reconnaître en lames minces par leur pureté (uniquement de l'argile et du fer), la bonne orientation de leurs particules argileuses élémentaires, et les fines couches successives bien visibles. (Source : INRA)
preferred label: illuviation cutans @en
top concept of: PLP

RDF description of
primary topic: cutanes d'illuviation