cutanes de diffusion
type: Concept
subject: Pedology @en
subject: Pédologie
definition: Revêtements dus à une concentration d'un élément au sein du fond matriciel, concentration qui atteint son maximum à leur surface externe. (Source : INRA)
in scheme: PLP
preferred label: diffusion cutans @en
top concept of: PLP

RDF description of
primary topic: cutanes de diffusion