RDF description of
primary topic: petrocalcic horizon

petrocalcic horizon
type: Concept
subject: Geology
subject: Pedology
subject: Géologie @fr
subject: Pédologie @fr
modified: 2020-07-03T11:12:19.342+02:00
alternative label: hard crust
definition: Faciès particulier d'horizon d'accumulation de calcaire secondaire, continu, épais et très induré, impénétrable aux racines (WRB). (Source : INRA) @fr
in scheme: PLP
preferred label: dalle (horizon) @fr
related: http://opendata.inrae.fr/PLP/462
related: http://opendata.inrae.fr/PLP/324
top concept of: PLP