RDF description of
primary topic: danger

danger
type: Concept
subject: Environnement
subject: Environment @en
definition: Capacité d'un agent biologique, chimique ou physique, ou propriété de cet agent, pouvant avoir un effet néfaste sur la santé d'un être vivant. (Source : INRA)
in scheme: PLP
preferred label: hazard @en
related: http://opendata.inrae.fr/PLP/318
related: http://opendata.inrae.fr/PLP/353
related: http://opendata.inrae.fr/PLP/352
related: http://opendata.inrae.fr/PLP/818
related: http://opendata.inrae.fr/PLP/895
top concept of: PLP