RDF description of
primary topic: agricutane

agricutane
type: Concept
subject: Pedology @en
subject: Pédologie
definition: Revêtement constitué de matières organiques et minérales provenant de l'horizon de surface labouré. (Source : INRA)
in scheme: PLP
note: Fréquent sur les faces des agrégats des horizons BT des Luvisols Typiques et Néoluvisols. (Source : INRA)
preferred label: agricutan @en
top concept of: PLP