débit
type: Concept
subject: Geology @en
subject: Pedology @en
subject: Géologie
subject: Pédologie
alternative label: jointing @en
definition: Façon dont certaines roches dures se divisent spontanément sous l'action de l'altération météorique et/ou de la tectonique. (Source : INRA)
in scheme: PLP
note: Le débit naturel des roches dures peut revêtir une grande importance pour l'enracinement des plantes et pour la progression de l'altération vers la profondeur le long des joints. Il est également responsable de l'aspect des cailloux et pierres observables dans les sols les plus minces. Les formes les plus typées sont : " pavés " presque cubiques ; " laves " ou " lauzes " ou " dalles " de 1 à 5 cm d'épaisseur, régulières ; plaquettes minces. C'est seulement en coupes (talus, carrières, fosses profondes) que de bonnes observations sont possibles. Certaines roches massives ne présentent pas de débit spontané. (Source : INRA)
preferred label: splitting @en
related: http://opendata.inrae.fr/PLP/245
related: http://opendata.inrae.fr/PLP/129
top concept of: PLP

RDF description of
primary topic: débit