RDF description of
primary topic: décalcification

décalcification
type: Concept
subject: Pedology @en
subject: Agronomie
subject: Pédologie
subject: Agronomy @en
definition: Appauvrissement d'un horizon ou d'un sol en ions calcium. (Source : INRA)
in scheme: PLP
note: Ne pas confondre avec décarbonatation. (Source : INRA)
preferred label: decalcification @en
related: http://opendata.inrae.fr/PLP/254
top concept of: PLP