RDF description of
primary topic: carbonate removal

carbonate removal
type: Concept
subject: Geology
subject: Pedology
subject: Géologie @fr
subject: Pédologie @fr
alternative label: carbonate dissolution
alternative label: carbonate leaching
definition: Processus de disparition progressive des carbonates d'un sol ou d'une roche par dissolution. (Source : INRA) @fr
in scheme: PLP
note: Cette disparition provoque arithmétiquement l'accumulation relative de tous les constituants insolubles ou peu solubles (sables et limons silicatés, minéraux argileux, oxyhydroxydes de fer et éléments traces associés, etc.). (Source : INRA) @fr
preferred label: décarbonatation @fr
related: http://opendata.inrae.fr/PLP/392
related: http://opendata.inrae.fr/PLP/252
related: http://opendata.inrae.fr/PLP/4
related: http://opendata.inrae.fr/PLP/278
related: http://opendata.inrae.fr/PLP/77
related: http://opendata.inrae.fr/PLP/328
top concept of: PLP