RDF description of
primary topic: discoloration

discoloration
type: Concept
alternative label: bleaching
definition: Atténuation ou perte progressive de couleur d'un horizon ou d'un volume de sol, tirant vers des teintes livides, suite à une perte de fer (associé ou non à des minéraux argileux). (Source : INRA) @fr
in scheme: PLP
preferred label: décoloration @fr
related: http://opendata.inrae.fr/PLP/29
top concept of: PLP