RDF description of
primary topic: décontamination

décontamination
type: Concept
subject: Pedology @en
subject: Pédologie
definition: Élimination partielle ou totale de substances dangereuses présentes dans un sol afin de restaurer ses fonctions et de le remettre en état pour un usage voulu (ISO-AFNOR, 1997). (Source : INRA)
in scheme: PLP
preferred label: decontamination @en
top concept of: PLP