RDF description of
primary topic: décomposition des matières organiques

décomposition des matières organiques
type: Concept
subject: Pedology @en
subject: Pédologie
definition: Processus biochimique d'altération des matières organiques fraîches. (Source : INRA)
in scheme: PLP
note: Si le processus est complet, il mène à la formation de composés organiques plus ou moins humifiés. S'il est incomplet (absence de décomposeurs, anoxie), il conduit à la formation d'horizons holorganiques OF, Hf ou Hm. (Source : INRA)
preferred label: decay @en
top concept of: PLP