RDF description of
primary topic: dénitrification

dénitrification
type: Concept
subject: Pedology @en
subject: Agronomie
subject: Pédologie
subject: Agronomy @en
definition: Transformation biochimique (réduction) des formes d'azote nitriques et nitreuses en protoxyde d'azote NO2, puis en oxydes d'azote NyOx et finalement en azote moléculaire. (Source : INRA)
in scheme: PLP
note: Grâce à certaines bactéries anaérobies, certains sols de zones humides sont capables de dénitrification et jouent, de ce fait, un rôle environnemental éminent. (Source : INRA)
preferred label: denitrification @en
top concept of: PLP