RDF description of
primary topic: désagrégation d'une roche

désagrégation d'une roche
type: Concept
subject: Geology @en
subject: Pedology @en
subject: Géologie
subject: Pédologie
definition: Décomposition d'une roche ou des éléments grossiers d'un sol par l'action physique des agents atmosphériques (gel, changements de températures). (Source : INRA)
in scheme: PLP
preferred label: physical weathering @en
top concept of: PLP