RDF description of
primary topic: désaturation du complexe adsorbant

désaturation du complexe adsorbant
type: Concept
subject: Pedology @en
subject: Pédologie
definition: Phénomène progressif de remplacement des cations alcalins et alcalino-terreux du complexe adsorbant par des cations Al3+ ou des protons. (Source : INRA)
in scheme: PLP
preferred label: desaturation @en
top concept of: PLP