RDF description of
primary topic: agrosystème

agrosystème
type: Concept
subject: Pedology @en
subject: Agronomie
subject: Pédologie
subject: Agronomy @en
definition: Écosystème entièrement ou partiellement cultivé et fortement artificialisé de ce fait. (Source : INRA)
in scheme: PLP
preferred label: agrosystem @en
related: http://opendata.inrae.fr/PLP/307
top concept of: PLP