désorption
type: Concept
subject: Pedology @en
subject: Pédologie
definition: Phénomène dans lequel les particules, molécules ou ions préalablement adsorbés sur des surfaces chargées électriquement sont libérés. (Source : INRA)
in scheme: PLP
preferred label: desorption @en
top concept of: PLP

RDF description of
primary topic: désorption