discontinuité lithologique
type: Concept
subject: Pedology @en
subject: Pédologie
definition: Présence de deux matériaux bien distincts superposés au sein d'un solum. (Source : INRA)
in scheme: PLP
note: Un certain nombre de critères peuvent servir à reconnaître l'existence d'une discontinuité : granulométrie (y compris les éléments grossiers), nature des minéraux argileux, nature des éléments grossiers, etc. (Source : INRA)
preferred label: lithological discontinuity @en
related: http://opendata.inrae.fr/PLP/110
related: http://opendata.inrae.fr/PLP/521
related: http://opendata.inrae.fr/PLP/841
related: http://opendata.inrae.fr/PLP/37
top concept of: PLP

RDF description of
primary topic: discontinuité lithologique